Target
Adenosine deaminase
Ligand
BDBM28388
Substrate
BDBM14487
Meas. Tech.
ADA Enzyme Inhibition Assay
pH
7.2±n/a
Temperature
303.15±n/a K
Ki
160±10 nM
Citation
 La Motta, CSartini, SMugnaini, LSalerno, SSimorini, FTaliani, SMarini, AMDa Settimo, FLavecchia, ANovellino, EAntonioli, LFornai, MBlandizzi, CDel Tacca, M Exploiting the pyrazolo[3,4-d]pyrimidin-4-one ring system as a useful template to obtain potent adenosine deaminase inhibitors. J Med Chem 52:1681-92 (2009)  
Target
Name:
Adenosine deaminase
Synonyms:
ADA Adenosine aminohydrolase
Type:
Enzyme
Mol. Mass.:
40910.44
Organism:
Bos taurus (bovine)
Description:
Residue:
363
  
Inhibitor
Name:
BDBM28388
Synonyms:
3-[4-({4-oxo-2H,4H,5H-pyrazolo[3,4-d]pyrimidin-2-yl}methyl)phenyl]-1-[4-(trifluoromethyl)phenyl]urea | pyrazolo[3,4-d]pyrimidin-4-one, 14d
Type:
Small organic molecule
Emp. Form.:
C20H15F3N6O2
Mol. Mass.:
428.3673
SMILES:
FC(F)(F)c1ccc(NC(=O)Nc2ccc(Cn3cc4c(n3)nc[nH]c4=O)cc2)cc1
:
Substrate
Name:
BDBM14487
Synonyms:
(2R,3R,4S,5R)-2-(6-amino-9H-purin-9-yl)-5-(hydroxymethyl)oxolane-3,4-diol Adenosine N6-Methylado cid_191 | cid_60961
Type:
Nucleoside or nucleotide
Emp. Form.:
C10H13N5O4
Mol. Mass.:
267.2413
SMILES:
Nc1ncnc2n(cnc12)[C@@H]1O[C@H](CO)[C@@H](O)[C@H]1O
: