Target
Serine/threonine-protein kinase pim-2
Ligand
BDBM28397
Substrate
PIM peptide substrate
Meas. Tech.
Pim Kinase Dose-Response Assay
IC50
12±n/a nM
Citation
 Qian, KWang, LCywin, CLFarmer, BTHickey, EHomon, CJakes, SKashem, MALee, GLeonard, SLi, JMagboo, RMao, WPack, EPeng, CProkopowicz, AWelzel, MWolak, JMorwick, T Hit to lead account of the discovery of a new class of inhibitors of Pim kinases and crystallographic studies revealing an unusual kinase binding mode. J Med Chem 52:1814-27 (2009)  
Target
Name:
Serine/threonine-protein kinase pim-2
Synonyms:
PIM2 Pim-2h Serine/threonine-protein kinase PIM | Serine/threonine-protein kinase pim-2 (PIM2)
Type:
Serine/threonine-protein kinase
Mol. Mass.:
34185.93
Organism:
Homo sapiens (Human)
Description:
Q9P1W9
Residue:
311
  
Inhibitor
Name:
BDBM28397
Synonyms:
(2E)-3-(3-{6-[(4-aminocyclohexyl)amino]pyrazin-2-yl}phenyl)prop-2-enoic acid | pyrazine inhibitor, 23
Type:
Small organic molecule
Emp. Form.:
C19H22N4O2
Mol. Mass.:
338.4036
SMILES:
N[C@H]1CC[C@@H](CC1)Nc1cncc(n1)-c1cccc(\C=C\C(O)=O)c1
:
Substrate
Name:
PIM peptide substrate
Synonyms:
Type:
Biotinylated peptide
Mol. Mass.:
1402.69
Organism:
Description:
Residue:
12
ITINAKRRRLSA