Target
Isoform 2 of Nuclear receptor ROR-gamma (RORgT)
Ligand
BDBM392075
Substrate
Meas. Tech.
RORgamma Gal4 Reporter Gene Assay (REN)
IC50
1.000±n/a nM
Citation
 Gege, CSteeneck, CKinzel, OKleymann, GHoffmann, T Carboxamide or sulfonamide substituted thiazoles and related derivatives as modulators for the orphan nuclear receptor ROR[γ] US Patent  US10301272 Publication Date 5/28/2019 
Target
Name:
Isoform 2 of Nuclear receptor ROR-gamma (RORgT)
Synonyms:
Isoform 2 of Nuclear receptor ROR-gamma Nuclear receptor ROR-gamma (RORgT) RORC RORG_HUMAN Retinoid-related orphan receptor-gamma (RORgT) | Retinoid-related orphan receptor-gamma (RORĪ³T)
Type:
Protein
Mol. Mass.:
55831.73
Organism:
Homo sapiens (Human)
Description:
P51449-2
Residue:
497
  
Inhibitor
Name:
BDBM392075
Synonyms:
US10301272, Example 7/8
Type:
Small organic molecule
Emp. Form.:
C30H41N3O5S2
Mol. Mass.:
587.794
SMILES:
CC(C)(C)NS(=O)(=O)c1ccc(-c2sc(nc2CC2CCCCC2)C(=O)N[C@H]2C[C@@H](C2)C(O)=O)c2CCCCc12
: