Target
Tyrosine-protein phosphatase non-receptor type 11
Ligand
BDBM38021
Substrate
Meas. Tech.
SHP2 Allosteric Inhibition Assay
IC50
5700±n/a nM
Citation
 Chen, ZDore, MFortanet, JGKarki, RKato, MLaMarche, MJPerez, LBWilliams, SSendzik, M 1-(triazin-3-yl/pyridazin-3-yl)-piper(-azine)idine derivatives and compositions therefor for inhibiting the activity of SHP2 US Patent  US10301278 Publication Date 5/28/2019 
Target
Name:
Tyrosine-protein phosphatase non-receptor type 11
Synonyms:
PTN11_HUMAN PTP-2C PTPN11 Protein tyrosine phosphatase (PTP) Shp2 Protein-tyrosine phosphatase 2C SHP2 Src homology phosphatase 2 (SHP-2) Tyrosine-protein phosphatase non-receptor type 11 (PTPN11) Tyrosine-protein phosphatase non-receptor type 11 (SHP2)
Type:
Protein phosphatase
Mol. Mass.:
68443.59
Organism:
Homo sapiens (Human)
Description:
Q06124
Residue:
597
  
Inhibitor
Name:
BDBM38021
Synonyms:
US10093646, Compound 2 US10336774, Example 02 US11401259, Compound 2
Type:
Small organic molecule
Emp. Form.:
C16H18Cl2N4
Mol. Mass.:
337.247
SMILES:
CC1(N)CCN(CC1)c1cnc(cn1)-c1cccc(Cl)c1Cl
: