Target
Tyrosine-protein phosphatase non-receptor type 11
Ligand
BDBM392344
Substrate
Meas. Tech.
SHP2 Allosteric Inhibition Assay
IC50
67.0±n/a nM
Citation
 Chen, ZDore, MFortanet, JGKarki, RKato, MLaMarche, MJPerez, LBWilliams, SSendzik, M 1-(triazin-3-yl/pyridazin-3-yl)-piper(-azine)idine derivatives and compositions therefor for inhibiting the activity of SHP2 US Patent  US10301278 Publication Date 5/28/2019 
Target
Name:
Tyrosine-protein phosphatase non-receptor type 11
Synonyms:
PTN11_HUMAN PTP-2C PTPN11 Protein tyrosine phosphatase (PTP) Shp2 Protein-tyrosine phosphatase 2C SHP2 Src homology phosphatase 2 (SHP-2) Tyrosine-protein phosphatase non-receptor type 11 (PTPN11) Tyrosine-protein phosphatase non-receptor type 11 (SHP2)
Type:
Protein phosphatase
Mol. Mass.:
68443.59
Organism:
Homo sapiens (Human)
Description:
Q06124
Residue:
597
  
Inhibitor
Name:
BDBM392344
Synonyms:
US10301278, Example 26
Type:
Small organic molecule
Emp. Form.:
C17H19F4N5S
Mol. Mass.:
401.425
SMILES:
CC1(N)CCN(CC1)c1cnc(Sc2ccc(F)cc2C(F)(F)F)c(N)n1
: