Target
Tyrosine-protein phosphatase non-receptor type 11
Ligand
BDBM392358
Substrate
Meas. Tech.
SHP2 Allosteric Inhibition Assay
IC50
59.0±n/a nM
Citation
 Chen, ZDore, MFortanet, JGKarki, RKato, MLaMarche, MJPerez, LBWilliams, SSendzik, M 1-(triazin-3-yl/pyridazin-3-yl)-piper(-azine)idine derivatives and compositions therefor for inhibiting the activity of SHP2 US Patent  US10301278 Publication Date 5/28/2019 
Target
Name:
Tyrosine-protein phosphatase non-receptor type 11
Synonyms:
3.1.3.48 PTP-1D PTP2C Protein Tyrosine Phosphatase PPN11/Shp2 Protein-Tyrosine Phosphatase SHP-2 Protein-tyrosine phosphatase 2C SH-PTP3 SHP2 Src homology phosphatase 2 (SHP-2) Tyrosine-protein phosphatase non-receptor type 11 (SHP-2) | Tyrosine-protein phosphatase non-receptor type 11 (SHP2)
Type:
Protein phosphatase
Mol. Mass.:
68443.59
Organism:
Homo sapiens (Human)
Description:
Q06124
Residue:
593
  
Inhibitor
Name:
BDBM392358
Synonyms:
US10301278, Example 50
Type:
Small organic molecule
Emp. Form.:
C17H24ClN7S
Mol. Mass.:
393.937
SMILES:
CCC1(CN)CCN(CC1)c1cnc(Sc2ccnc(N)c2Cl)c(N)n1
: