Target
Macrophage metalloelastase
Ligand
BDBM28470
Substrate
BDBM28488
Meas. Tech.
MMP Inhibition Assay
pH
7.5±n/a
Temperature
295.15±n/a K
IC50
5±n/a nM
Citation
 Li, WLi, JWu, YWu, JHotchandani, RCunningham, KMcFadyen, IBard, JMorgan, PSchlerman, FXu, XTam, SGoldman, SJWilliams, CSypek, JMansour, TS A selective matrix metalloprotease 12 inhibitor for potential treatment of chronic obstructive pulmonary disease (COPD): discovery of (S)-2-(8-(methoxycarbonylamino)dibenzo[b,d]furan-3-sulfonamido)-3-methylbutanoic acid (MMP408). J Med Chem 52:1799-802 (2009)  
Target
Name:
Macrophage metalloelastase
Synonyms:
HME MMP12_HUMAN Matrix metalloproteinase-12 (MMP 12) Matrix metalloproteinase-12 (MMP12) | Matrix metalloproteinases 12 (MMP-12)
Type:
Enzyme
Mol. Mass.:
54012.99
Organism:
Homo sapiens (Human)
Description:
P39900
Residue:
470
  
Inhibitor
Name:
BDBM28470
Synonyms:
(2S)-2-({12-[(ethoxycarbonyl)amino]-8-oxatricyclo[7.4.0.0^{2,7}]trideca-1(9),2(7),3,5,10,12-hexaene-5-}sulfonamido)-3-methylbutanoic acid | dibenzofuran (DBF) scaffold, (S)-15
Type:
Small organic molecule
Emp. Form.:
C20H22N2O7S
Mol. Mass.:
434.463
SMILES:
CCOC(=O)Nc1ccc2oc3cc(ccc3c2c1)S(=O)(=O)N[C@@H](C(C)C)C(O)=O
:
Substrate
Name:
BDBM28488
Synonyms:
MMP Fluorogenic Substrate
Type:
Fluorogenic Substrate
Emp. Form.:
Mol. Mass.:
SMILES:
: