Target
Collagenase 3
Ligand
BDBM28482
Substrate
BDBM28488
Meas. Tech.
MMP Inhibition Assay
IC50
>1000±n/a nM
Citation
 Li, WLi, JWu, YWu, JHotchandani, RCunningham, KMcFadyen, IBard, JMorgan, PSchlerman, FXu, XTam, SGoldman, SJWilliams, CSypek, JMansour, TS A selective matrix metalloprotease 12 inhibitor for potential treatment of chronic obstructive pulmonary disease (COPD): discovery of (S)-2-(8-(methoxycarbonylamino)dibenzo[b,d]furan-3-sulfonamido)-3-methylbutanoic acid (MMP408). J Med Chem 52:1799-802 (2009)  
Target
Name:
Collagenase 3
Synonyms:
MMP-13 MMP13_HUMAN Matrix metalloproteinase-13 (MMP-13) | Matrix metalloproteinase-13 (MMP13)
Type:
Enzyme
Mol. Mass.:
53808.06
Organism:
Homo sapiens (Human)
Description:
P45452
Residue:
471
  
Inhibitor
Name:
BDBM28482
Synonyms:
(2S)-2-({11-[(methoxycarbonyl)amino]-8-oxatricyclo[7.4.0.0^{2,7}]trideca-1(9),2(7),3,5,10,12-hexaene-5-}sulfonamido)-3-methylbutanoic acid | dibenzofuran (DBF) scaffold, (S)-27
Type:
Small organic molecule
Emp. Form.:
C19H20N2O7S
Mol. Mass.:
420.436
SMILES:
COC(=O)Nc1ccc2c(c1)oc1cc(ccc21)S(=O)(=O)N[C@@H](C(C)C)C(O)=O
:
Substrate
Name:
BDBM28488
Synonyms:
MMP Fluorogenic Substrate
Type:
Fluorogenic Substrate
Emp. Form.:
Mol. Mass.:
SMILES:
: