Target
Plasma kallikrein
Ligand
BDBM392556
Substrate
Meas. Tech.
In Vitro Enzyme Inhibition
IC50
550±n/a nM
Citation
 McDonald, AQian, S Therapeutic inhibitory compounds US Patent  US10301284 Publication Date 5/28/2019 
Target
Name:
Plasma kallikrein
Synonyms:
Fletcher factor KLKB1 Kallikrein Plasma kallikrein heavy chain Plasma prekallikrein
Type:
Protein
Mol. Mass.:
71391.16
Organism:
Homo sapiens (Human)
Description:
P03952
Residue:
638
  
Inhibitor
Name:
BDBM392556
Synonyms:
N-((5-chloro-1H-indazol-3-yl)methyl)- 5-((3-chloroquinolin-6-yl)methyl)- 1,3,4-oxadiazole-2-carboxamide US10781200, Example 42
Type:
Small organic molecule
Emp. Form.:
C21H14Cl2N6O2
Mol. Mass.:
453.281
SMILES:
Clc1ccc2[nH]nc(CNC(=O)c3nnc(Cc4ccc5ncc(Cl)cc5c4)o3)c2c1
: