Target
Plasma kallikrein
Ligand
BDBM392611
Substrate
Meas. Tech.
In Vitro Enzyme Inhibition
IC50
<100±n/a nM
Citation
 McDonald, AQian, S Therapeutic inhibitory compounds US Patent  US10301284 Publication Date 5/28/2019 
Target
Name:
Plasma kallikrein
Synonyms:
Fletcher factor KLKB1 Kallikrein Plasma kallikrein heavy chain Plasma prekallikrein
Type:
Protein
Mol. Mass.:
71391.16
Organism:
Homo sapiens (Human)
Description:
P03952
Residue:
638
  
Inhibitor
Name:
BDBM392611
Synonyms:
N-((6-amino-2,4-dimethylpyridin-3- yl)methyl)-5-((3-chloroquinolin-6- yl)methyl)-4-methyl-4H-1,2,4-triazole- 3-carboxamide US10781200, Example 98
Type:
Small organic molecule
Emp. Form.:
C22H22ClN7O
Mol. Mass.:
435.909
SMILES:
Cc1cc(N)nc(C)c1CNC(=O)c1nnc(Cc2ccc3ncc(Cl)cc3c2)n1C
: