Target
Plasma kallikrein
Ligand
BDBM392626
Substrate
Meas. Tech.
In Vitro Enzyme Inhibition
IC50
550±n/a nM
Citation
 McDonald, AQian, S Therapeutic inhibitory compounds US Patent  US10301284 Publication Date 5/28/2019 
Target
Name:
Plasma kallikrein
Synonyms:
Fletcher factor KLKB1 Kallikrein Plasma kallikrein heavy chain Plasma prekallikrein
Type:
Protein
Mol. Mass.:
71391.16
Organism:
Homo sapiens (Human)
Description:
P03952
Residue:
638
  
Inhibitor
Name:
BDBM392626
Synonyms:
N-((6-amino-2,4-dimethylpyridin-3- yl)methyl)-1-((3-chloroquinolin-6- yl)methyl)-2-cyano-1H-imidazole-4- carboxamide US10781200, Example 113
Type:
Small organic molecule
Emp. Form.:
C23H20ClN7O
Mol. Mass.:
445.904
SMILES:
Cc1cc(N)nc(C)c1CNC(=O)c1cn(Cc2ccc3ncc(Cl)cc3c2)c(n1)C#N
: