Target
Melanocortin receptor 3
Ligand
BDBM392660
Substrate
Meas. Tech.
Test for Evaluating Human MC Receptor Activation, Using Cells Expressing Human MC4, MC1, or MC3 Receptor
EC50
330±n/a nM
Citation
 Sugane, TMakino, TYamashita, DYonetoku, YTanabe, DMihara, HAsai, NOsoda, KShimizu, TMoritomo, HSugasawa, KMaeno, KHosogai, N Piperazine derivative US Patent  US10301286 Publication Date 5/28/2019 
Target
Name:
Melanocortin receptor 3
Synonyms:
MC3-R MC3R_HUMAN Melanocortin receptor (M3 and M4)
Type:
Enzyme
Mol. Mass.:
36044.86
Organism:
Homo sapiens (Human)
Description:
P41968
Residue:
323
  
Inhibitor
Name:
BDBM392660
Synonyms:
US10301286, Example 76
Type:
Small organic molecule
Emp. Form.:
C30H37ClF3N3O3
Mol. Mass.:
580.081
SMILES:
C[C@H]1CN(CCN1C(=O)[C@@H]1CN(C[C@H]1c1ccc(Cl)cc1F)C(C)(C)C)[C@@H](Cc1c(F)cc(C)cc1F)C(O)=O
: