Target
Epidermal growth factor receptor
Ligand
BDBM28489
Substrate
Biotinylated Peptide Substrate
Meas. Tech.
Homogeneous Time Resolved Fluorescence (HTRF) Assay
pH
7.5±n/a
Temperature
296.15±n/a K
IC50
65±n/a nM
Comments
5% covalent modification of EGFR after 3h.
Citation
 Stevens, KLAlligood, KJAlberti, JGCaferro, TRChamberlain, SDDickerson, SHDickson, HDEmerson, HKGriffin, RJHubbard, RDKeith, BRMullin, RJPetrov, KGGerding, RMReno, MJRheault, TRRusnak, DWSammond, DMSmith, SCUehling, DEWaterson, AGWood, ER Synthesis and stereochemical effects of pyrrolidinyl-acetylenic thieno[3,2-d]pyrimidines as EGFR and ErbB-2 inhibitors. Bioorg Med Chem Lett 19:21-6 (2009)  
Target
Name:
Epidermal growth factor receptor
Synonyms:
EGF Receptor Substrate EGFR_HUMAN ERBB1 Epidermal Growth Factor Receptor erbB-1 Epidermal growth factor receptor (EGFR) HER1 Proto-oncogene c-ErbB-1 Tyrosine-Protein Kinase ErbB-1
Type:
Receptor Kinase Domain
Mol. Mass.:
134279.59
Organism:
Homo sapiens (Human)
Description:
P00533
Residue:
1210
  
Inhibitor
Name:
BDBM28489
Synonyms:
(3R,5S)-5-{2-[4-({3-chloro-4-[(3-fluorophenyl)methoxy]phenyl}amino)thieno[3,2-d]pyrimidin-6-yl]ethynyl}pyrrolidin-3-yl morpholine-4-carboxylate alkynyl thienopyrimidine, 15a
Type:
Small organic molecule
Emp. Form.:
C30H27ClFN5O4S
Mol. Mass.:
608.083
SMILES:
Fc1cccc(COc2ccc(Nc3ncnc4cc(sc34)C#C[C@@H]3C[C@H](CN3)OC(=O)N3CCOCC3)cc2Cl)c1
:
Substrate
Name:
Biotinylated Peptide Substrate
Synonyms:
Type:
Peptide
Mol. Mass.:
3934.43
Organism:
Description:
Residue:
34