Target
Tyrosine-protein kinase SYK
Ligand
BDBM392690
Substrate
Meas. Tech.
c-Src and Syk Enzyme Inhibition Assay
IC50
50.0±n/a nM
Citation
 Fyfe, MC Kinase inhibitors US Patent  US10301288 Publication Date 5/28/2019 
Target
Name:
Tyrosine-protein kinase SYK
Synonyms:
KSYK_HUMAN Spleen Tyrosine Kinase Tyrosine-protein kinase SYK (Syk)
Type:
Enzyme
Mol. Mass.:
72079.99
Organism:
Homo sapiens (Human)
Description:
P43405
Residue:
635
  
Inhibitor
Name:
BDBM392690
Synonyms:
3-Ethynyl-5-((4-((4-(3-(3-isopropyl-1-(p-tolyl)-1H-pyrazol-5-yl)ureido)-naphthalen-1-yl)oxy)pyrimidin-2-yl)amino)-N-(2-(2-(2-methoxyethoxy)ethoxy)ethyl)-benzamide US10301288, Example 2
Type:
Small organic molecule
Emp. Form.:
C44H46N8O6
Mol. Mass.:
782.886
SMILES:
COCCOCCOCCNC(=O)c1cc(Nc2nccc(Oc3ccc(NC(=O)Nc4cc(nn4-c4ccc(C)cc4)C(C)C)c4ccccc34)n2)cc(c1)C#C
: