Target
Glycogen synthase kinase-3 alpha
Ligand
BDBM392693
Substrate
Meas. Tech.
GSK 3alpha Enzyme Inhibition Assay (method 2)
IC50
9547±n/a nM
Citation
 Fyfe, MC Kinase inhibitors US Patent  US10301288 Publication Date 5/28/2019 
Target
Name:
Glycogen synthase kinase-3 alpha
Synonyms:
GSK-3 alpha GSK3A_HUMAN Glycogen synthase kinase-3 Glycogen synthase kinase-3 alpha (GSK3 Alpha) Glycogen synthase kinase-3 alpha (GSK3alpha)
Type:
Enzyme
Mol. Mass.:
50991.79
Organism:
Homo sapiens (Human)
Description:
P49840
Residue:
483
  
Inhibitor
Name:
BDBM392693
Synonyms:
US10301288, Example 4
Type:
Small organic molecule
Emp. Form.:
C44H49N7O7
Mol. Mass.:
787.9026
SMILES:
COCCOCCOCCNC(=O)c1cc(Nc2cc(Oc3ccc(NC(=O)Nc4cc(nn4-c4ccc(C)cc4)C(C)C)c4ccccc34)ccn2)cc(OC)c1
: