Target
Glycogen synthase kinase-3 alpha
Ligand
BDBM392699
Substrate
Meas. Tech.
GSK 3alpha Enzyme Inhibition Assay (method 2)
IC50
12034±n/a nM
Citation
 Fyfe, MC Kinase inhibitors US Patent  US10301288 Publication Date 5/28/2019 
Target
Name:
Glycogen synthase kinase-3 alpha
Synonyms:
GSK-3 alpha GSK3A_HUMAN Glycogen synthase kinase-3 Glycogen synthase kinase-3 alpha (GSK3 Alpha) Glycogen synthase kinase-3 alpha (GSK3alpha)
Type:
Enzyme
Mol. Mass.:
50991.79
Organism:
Homo sapiens (Human)
Description:
P49840
Residue:
483
  
Inhibitor
Name:
BDBM392699
Synonyms:
3-((4-((4-(3-(3-(tert-Butyl)-1-(4-(dimethylamino)phenyl)-1H-pyrazol-5-yl)ureido)-naphthalen-1-yl)oxy)pyridin-2-yl)amino)-5-methoxy-N-(2-(2-(2-methoxyethoxy)-ethoxy)ethyl)benzamide | US10301288, Example 10
Type:
Small organic molecule
Emp. Form.:
C46H54N8O7
Mol. Mass.:
830.9704
SMILES:
COCCOCCOCCNC(=O)c1cc(Nc2cc(Oc3ccc(NC(=O)Nc4cc(nn4-c4ccc(cc4)N(C)C)C(C)(C)C)c4ccccc34)ccn2)cc(OC)c1
: