Target
Bile acid receptor
Ligand
BDBM28535
Substrate
BDBM10852
Meas. Tech.
FXR Co-transfection Assay
pH
7±n/a
Temperature
295.15±n/a K
EC50
60±n/a nM
Comments
145% efficacy.
Citation
 Flatt, BMartin, RWang, TLMahaney, PMurphy, BGu, XHFoster, PLi, JPircher, PPetrowski, MSchulman, IWestin, SWrobel, JYan, GBischoff, EDaige, CMohan, R Discovery of XL335 (WAY-362450), a Highly Potent, Selective, and Orally Active Agonist of the Farnesoid X Receptor (FXR). J Med Chem 52:904-7 (2009)  
Target
Name:
Bile acid receptor
Synonyms:
BAR FXR HRR1 NR1H4_HUMAN RIP14 Retinoid X receptor-interacting protein 14 | farnesoid x receptor
Type:
Nuclear Receptor
Mol. Mass.:
55916.24
Organism:
Homo sapiens (Human)
Description:
Q96RI1
Residue:
486
  
Inhibitor
Name:
BDBM28535
Synonyms:
Azepino[4,5-b]indole, 6f | ethyl 3-[(4-methoxyphenyl)carbonyl]-1-methyl-1H,2H,3H,6H-azepino[4,5-b]indole-5-carboxylate
Type:
Small organic molecule
Emp. Form.:
C24H24N2O4
Mol. Mass.:
404.4584
SMILES:
CCOC(=O)C1=CN(CC(C)c2c1[nH]c1ccccc21)C(=O)c1ccc(OC)cc1
:
Substrate