Target
Bile acid receptor
Ligand
BDBM28542
Substrate
BDBM10852
Meas. Tech.
FXR Co-transfection Assay
pH
7±n/a
Temperature
295.15±n/a K
EC50
4±n/a nM
Comments
149% efficacy.
Citation
 Flatt, BMartin, RWang, TLMahaney, PMurphy, BGu, XHFoster, PLi, JPircher, PPetrowski, MSchulman, IWestin, SWrobel, JYan, GBischoff, EDaige, CMohan, R Discovery of XL335 (WAY-362450), a Highly Potent, Selective, and Orally Active Agonist of the Farnesoid X Receptor (FXR). J Med Chem 52:904-7 (2009)  
Target
Name:
Bile acid receptor
Synonyms:
BAR FXR HRR1 NR1H4_HUMAN RIP14 Retinoid X receptor-interacting protein 14 | farnesoid x receptor
Type:
Nuclear Receptor
Mol. Mass.:
55916.24
Organism:
Homo sapiens (Human)
Description:
Q96RI1
Residue:
486
  
Inhibitor
Name:
BDBM28542
Synonyms:
WAY-362450 propan-2-yl 3-[(3,4-difluorophenyl)carbonyl]-1,1-dimethyl-1H,2H,3H,6H-azepino[4,5-b]indole-5-carboxylate
Type:
Small organic molecule
Emp. Form.:
C25H24F2N2O3
Mol. Mass.:
438.4665
SMILES:
CC(C)OC(=O)C1=CN(CC(C)(C)c2c1[nH]c1ccccc21)C(=O)c1ccc(F)c(F)c1
:
Substrate