Target
Mitogen-activated protein kinase 10
Ligand
BDBM392722
Substrate
Meas. Tech.
Measurement of JNK3 Enzyme Activity
IC50
65±n/a nM
Citation
 Hah, JYang, SILee, JH Imidazole derivative having JNK inhibitory activity and use thereof US Patent  US10301291 Publication Date 5/28/2019 
Target
Name:
Mitogen-activated protein kinase 10
Synonyms:
JNK3 MAP kinase p49 3F12 MK10_HUMAN Mitogen-activated protein kinase 10 (Stress-activated protein kinase JNK3) (c-Jun N-terminal kinase 3) (MAP kinase p49 3F12) PRKM10 Stress-activated protein kinase JNK3 | c-Jun N-terminal kinase 3 (JNK3)
Type:
Enzyme
Mol. Mass.:
52586.89
Organism:
Homo sapiens (Human)
Description:
Residue:
464
  
Inhibitor
Name:
BDBM392722
Synonyms:
Example 16 | US10301291, Compound 12d
Type:
Small organic molecule
Emp. Form.:
C22H20N6O
Mol. Mass.:
384.4338
SMILES:
CC(O)CNc1nccc(n1)-n1c(CC#N)cnc1-c1ccc2ccccc2c1
: