Target
Mitogen-activated protein kinase 10
Ligand
BDBM392729
Substrate
Meas. Tech.
Measurement of JNK3 Enzyme Activity
IC50
65±n/a nM
Citation
 Hah, JYang, SILee, JH Imidazole derivative having JNK inhibitory activity and use thereof US Patent  US10301291 Publication Date 5/28/2019 
Target
Name:
Mitogen-activated protein kinase 10
Synonyms:
JNK3 MAP kinase p49 3F12 MK10_HUMAN Mitogen-activated protein kinase 10 (Stress-activated protein kinase JNK3) (c-Jun N-terminal kinase 3) (MAP kinase p49 3F12) PRKM10 Stress-activated protein kinase JNK3 | c-Jun N-terminal kinase 3 (JNK3)
Type:
Enzyme
Mol. Mass.:
52586.89
Organism:
Homo sapiens (Human)
Description:
Residue:
464
  
Inhibitor
Name:
BDBM392729
Synonyms:
Example 29 | US10301291, Compound 14e
Type:
Small organic molecule
Emp. Form.:
C20H19Cl2N7
Mol. Mass.:
428.318
SMILES:
Clc1ccc(cc1Cl)-c1ncc(CC#N)n1-c1ccnc(NC2CCCNC2)n1
: