Target
D(2) dopamine receptor
Ligand
BDBM28579
Substrate
BDBM21397
Meas. Tech.
Radioligand Binding Assay (Ki)
pH
7.4±n/a
Temperature
295.15±n/a K
Ki
>2000±n/a nM
Citation
 Liu, KGLo, JRComery, TAZhang, GMZhang, JYKowal, DMSmith, DLDi, LKerns, EHSchechter, LERobichaud, AJ 1-Sulfonylindazoles as potent and selective 5-HT6 ligands. Bioorg Med Chem Lett 19:2413-5 (2009)  
Target
Name:
D(2) dopamine receptor
Synonyms:
D(2) dopamine receptor DOPAMINE D2 Long DRD2 Dopamine D2 receptor Dopamine D2 receptor (D2R) Dopamine2-like | d2
Type:
Cell-surface receptors
Mol. Mass.:
50647.10
Organism:
Homo sapiens (Human)
Description:
P14416
Residue:
443
  
Inhibitor
Name:
BDBM28579
Synonyms:
1-sulfonylindazole, 7a | N-[1-(naphthalene-1-sulfonyl)-1H-indazol-6-yl]piperidine-4-carboxamide
Type:
Small organic molecule
Emp. Form.:
C23H22N4O3S
Mol. Mass.:
434.511
SMILES:
O=C(Nc1ccc2cnn(c2c1)S(=O)(=O)c1cccc2ccccc12)C1CCNCC1
:
Substrate
Name:
BDBM21397
Synonyms:
8-[4-(4-fluorophenyl)-4-keto-butyl]-1-phenyl-1,3,8-triazaspiro[4.5]decan-4-one 8-[4-(4-fluorophenyl)-4-oxobutyl]-1-phenyl-1,3,8-triazaspiro[4.5]decan-4-one MLS000028615 SPIPERONE US9359372, Spiperone cid_5265
Type:
radiolabeled ligand
Emp. Form.:
C23H26FN3O2
Mol. Mass.:
395.4698
SMILES:
Fc1ccc(cc1)C(=O)CCCN1CCC2(CC1)N(CNC2=O)c1ccccc1
: