Target
Tyrosine-protein kinase BTK
Ligand
BDBM389627
Substrate
Meas. Tech.
IC50 Determination of BTK Inhibitors in ADP-Glo Kinase Biochemical Assay
IC50
750±n/a nM
Citation
 Chen, XGao, YLiu, CNi, HMulvihill, M Substituted nicotinimide inhibitors of BTK and their preparation and use in the treatment of cancer, inflammation and autoimmune disease US Patent  US10301297 Publication Date 5/28/2019 
Target
Name:
Tyrosine-protein kinase BTK
Synonyms:
AGMX1 Agammaglobulinaemia tyrosine kinase B cell progenitor kinase BPK BTK_HUMAN Tyrosine Kinase BTK Tyrosine-protein kinase BTK (BTK)
Type:
Enzyme
Mol. Mass.:
76289.95
Organism:
Homo sapiens (Human)
Description:
Q06187
Residue:
659
  
Inhibitor
Name:
BDBM389627
Synonyms:
6-(4-acrylamidopiperidin-1-yl)-2-(4-phenoxyphenyl)nicotinamide US11840513, Example 9 | US9951056, Example 9
Type:
Small organic molecule
Emp. Form.:
C26H26N4O3
Mol. Mass.:
442.5096
SMILES:
NC(=O)c1ccc(nc1-c1ccc(Oc2ccccc2)cc1)N1CCC(CC1)NC(=O)C=C
: