Target
Tyrosine-protein kinase BTK
Ligand
BDBM389651
Substrate
Meas. Tech.
IC50 Determination of BTK Inhibitors in ADP-Glo Kinase Biochemical Assay
IC50
<500±n/a nM
Citation
 Chen, XGao, YLiu, CNi, HMulvihill, M Substituted nicotinimide inhibitors of BTK and their preparation and use in the treatment of cancer, inflammation and autoimmune disease US Patent  US10301297 Publication Date 5/28/2019 
Target
Name:
Tyrosine-protein kinase BTK
Synonyms:
AGMX1 Agammaglobulinaemia tyrosine kinase B cell progenitor kinase BPK BTK_HUMAN Tyrosine Kinase BTK Tyrosine-protein kinase BTK (BTK)
Type:
Enzyme
Mol. Mass.:
76289.95
Organism:
Homo sapiens (Human)
Description:
Q06187
Residue:
659
  
Inhibitor
Name:
BDBM389651
Synonyms:
(E)-6-(4-(4-(dimethylamino)but-2-enoyl)piperazin-1-yl)-2-(4-phenoxyphenyl)nicotinamide US11840513, Example 25 | US9951056, Example 25
Type:
Small organic molecule
Emp. Form.:
C28H31N5O3
Mol. Mass.:
485.5774
SMILES:
CN(C)C\C=C\C(=O)N1CCN(CC1)c1ccc(C(N)=O)c(n1)-c1ccc(Oc2ccccc2)cc1
: