Target
Steroidogenic factor 1
Ligand
BDBM28649
Substrate
BDBM10852
Meas. Tech.
Transactivation Cell-Based Assay
EC50
190±10 nM
Citation
 Roth, JMadoux, FHodder, PRoush, WR Synthesis of small molecule inhibitors of the orphan nuclear receptor steroidogenic factor-1 (NR5A1) based on isoquinolinone scaffolds. Bioorg Med Chem Lett 18:2628-32 (2008)  
Target
Name:
Steroidogenic factor 1
Synonyms:
AD4BP FTZF1 NR5A1 SF-1 STF-1 Steroid hormone receptor Ad4BP
Type:
Nuclear Hormone Receptor
Mol. Mass.:
51643.43
Organism:
Homo sapiens (Human)
Description:
Residue:
461
  
Inhibitor
Name:
BDBM28649
Synonyms:
ethyl 2-[(2-{[(4-ethoxyphenyl)carbamoyl]methyl}-1-oxo-1,2-dihydroisoquinolin-5-yl)oxy]propanoate | isoquinolinone scaffold, 33
Type:
Small organic molecule
Emp. Form.:
C24H26N2O6
Mol. Mass.:
438.473
SMILES:
CCOC(=O)C(C)Oc1cccc2c1ccn(CC(=O)Nc1ccc(OCC)cc1)c2=O
:
Substrate