Target
D-alanine--D-alanyl carrier protein ligase
Ligand
BDBM392744
Substrate
Meas. Tech.
in vitro DltA activity assay
IC50
19.0±n/a nM
Citation
 Atamanyuk, DChevreuil, FFaivre, FLecointe, NLedoussal, BOliveira, CSimon, CGerusz, V Heteroaromatic derivatives and their use as pharmaceuticals US Patent  US10301305 Publication Date 5/28/2019 
Target
Name:
D-alanine--D-alanyl carrier protein ligase
Synonyms:
D-alanine--poly(phosphoribitol) ligase subunit 1 DCL | dltA
Type:
Enzyme Catalytic Domain
Mol. Mass.:
56357.51
Organism:
Enterococcus faecalis (strain ATCC 700802 / V583)
Description:
Residue:
506
  
Inhibitor
Name:
BDBM392744
Synonyms:
7-(1-Cyclohexyl-1H-benzimidazol-5-yl)-5-(hexahydro-pyrrolo[3,4-c]pyrrol-2-yl)-3H-imidazo[4,5-b]pyridine | US10301305, Example 11
Type:
Small organic molecule
Emp. Form.:
C25H29N7
Mol. Mass.:
427.5447
SMILES:
C1NCC2CN(CC12)c1cc(-c2ccc3n(cnc3c2)C2CCCCC2)c2nc[nH]c2n1
: