Target
D-alanine--D-alanyl carrier protein ligase
Ligand
BDBM392794
Substrate
Meas. Tech.
in vitro DltA activity assay
IC50
2.00±n/a nM
Citation
 Atamanyuk, DChevreuil, FFaivre, FLecointe, NLedoussal, BOliveira, CSimon, CGerusz, V Heteroaromatic derivatives and their use as pharmaceuticals US Patent  US10301305 Publication Date 5/28/2019 
Target
Name:
D-alanine--D-alanyl carrier protein ligase
Synonyms:
D-alanine--poly(phosphoribitol) ligase subunit 1 DCL | dltA
Type:
Enzyme Catalytic Domain
Mol. Mass.:
56736.38
Organism:
Enterococcus faecium E1679
Description:
Q3XZT7
Residue:
504
  
Inhibitor
Name:
BDBM392794
Synonyms:
5-[4,4-bis(hydroxymethyl)-1-piperidyl]-7-(1-cyclohexylbenzimidazol-5-yl)-3H-benzimidazole-4-carboxamide | US10301305, Example 211
Type:
Small organic molecule
Emp. Form.:
C28H34N6O3
Mol. Mass.:
502.608
SMILES:
NC(=O)c1c(cc(-c2ccc3n(cnc3c2)C2CCCCC2)c2nc[nH]c12)N1CCC(CO)(CO)CC1
: