Target
Receptor-interacting serine/threonine-protein kinase 3
Ligand
BDBM392852
Substrate
Meas. Tech.
RIPK3 HTRF Kinase Assay
IC50
7550±n/a nM
Citation
 Hart, ACPitts, WJMastalerz, HGuo, JBrown, GD Substituted dihydro-1H-pyrrolo[3,2-c]pyridin-4(5H)-ones as RIPK3 inhibitors US Patent  US10301306 Publication Date 5/28/2019 
Target
Name:
Receptor-interacting serine/threonine-protein kinase 3
Synonyms:
RIP-3 RIP3 RIPK3_HUMAN | Receptor-interacting protein 3
Type:
PROTEIN
Mol. Mass.:
56886.12
Organism:
Homo sapiens (Human)
Description:
ChEMBL_881455
Residue:
518
  
Inhibitor
Name:
BDBM392852
Synonyms:
US10301306, Example 50
Type:
Small organic molecule
Emp. Form.:
C24H21FN4O2
Mol. Mass.:
416.4475
SMILES:
Cc1noc(C)c1Cn1c2CCNC(=O)c2c(c1-c1ccncc1)-c1ccc(F)cc1
: