Target
Receptor-interacting serine/threonine-protein kinase 3
Ligand
BDBM392942
Substrate
Meas. Tech.
RIPK3 HTRF Kinase Assay
IC50
<30±n/a nM
Citation
 Hart, ACPitts, WJMastalerz, HGuo, JBrown, GD Substituted dihydro-1H-pyrrolo[3,2-c]pyridin-4(5H)-ones as RIPK3 inhibitors US Patent  US10301306 Publication Date 5/28/2019 
Target
Name:
Receptor-interacting serine/threonine-protein kinase 3
Synonyms:
RIP-3 RIP3 RIPK3_HUMAN | Receptor-interacting protein 3
Type:
PROTEIN
Mol. Mass.:
56886.12
Organism:
Homo sapiens (Human)
Description:
ChEMBL_881455
Residue:
518
  
Inhibitor
Name:
BDBM392942
Synonyms:
US10301306, Example 140
Type:
Small organic molecule
Emp. Form.:
C26H20FN5O2
Mol. Mass.:
453.4677
SMILES:
COc1cc(ccn1)-c1c2c(CCNC2=O)n(Cc2ccc(F)cc2C#N)c1-c1ccncc1
: