Target
Receptor-interacting serine/threonine-protein kinase 3
Ligand
BDBM392956
Substrate
Meas. Tech.
RIPK3 HTRF Kinase Assay
IC50
7550±n/a nM
Citation
 Hart, ACPitts, WJMastalerz, HGuo, JBrown, GD Substituted dihydro-1H-pyrrolo[3,2-c]pyridin-4(5H)-ones as RIPK3 inhibitors US Patent  US10301306 Publication Date 5/28/2019 
Target
Name:
Receptor-interacting serine/threonine-protein kinase 3
Synonyms:
RIP-3 RIP3 RIPK3_HUMAN | Receptor-interacting protein 3
Type:
PROTEIN
Mol. Mass.:
56886.12
Organism:
Homo sapiens (Human)
Description:
ChEMBL_881455
Residue:
518
  
Inhibitor
Name:
BDBM392956
Synonyms:
3-(4-Fluorophenyl)-1,7,7-trimethyl-2-(pyridin-4-yl)-6,7-dihydro-1H-pyrrolo[3,2-c]pyridin-4(5H)-one | US10301306, Example 154
Type:
Small organic molecule
Emp. Form.:
C21H20FN3O
Mol. Mass.:
349.4014
SMILES:
Cn1c(c(c2c1C(C)(C)CNC2=O)-c1ccc(F)cc1)-c1ccncc1
: