Target
Receptor-interacting serine/threonine-protein kinase 3
Ligand
BDBM392979
Substrate
Meas. Tech.
RIPK3 HTRF Kinase Assay
IC50
7550±n/a nM
Citation
 Hart, ACPitts, WJMastalerz, HGuo, JBrown, GD Substituted dihydro-1H-pyrrolo[3,2-c]pyridin-4(5H)-ones as RIPK3 inhibitors US Patent  US10301306 Publication Date 5/28/2019 
Target
Name:
Receptor-interacting serine/threonine-protein kinase 3
Synonyms:
RIP-3 RIP3 RIPK3_HUMAN | Receptor-interacting protein 3
Type:
PROTEIN
Mol. Mass.:
56886.12
Organism:
Homo sapiens (Human)
Description:
ChEMBL_881455
Residue:
518
  
Inhibitor
Name:
BDBM392979
Synonyms:
US10301306, Example 177
Type:
Small organic molecule
Emp. Form.:
C28H28N6O2
Mol. Mass.:
480.5609
SMILES:
Cc1cc(Cn2c3CCNC(=O)c3c(c2-c2ccncc2)-c2cccc(NC(=O)C3CC3)c2)n(C)n1
: