Target
Mitogen-activated protein kinase 1
Ligand
BDBM318237
Substrate
Meas. Tech.
Inhibition Assays of ERK
IC50
<50±n/a nM
Citation
 Li, LWu, TFeng, JRen, PLiu, Y Inhibitors of ERK and methods of use US Patent  US10301317 Publication Date 5/28/2019 
Target
Name:
Mitogen-activated protein kinase 1
Synonyms:
ERK2 Extracellular signal-regulated kinase 2 Extracellular signal-regulated kinase 2 (ERK2) MAPK 2 MK01_HUMAN Mitogen-activated protein kinase 1 (ERK-2) Mitogen-activated protein kinase 2 PRKM2 | p42-MAPK
Type:
Ser/Thr Protein Kinase
Mol. Mass.:
41392.76
Organism:
Homo sapiens (Human)
Description:
P28482
Residue:
360
  
Inhibitor
Name:
BDBM318237
Synonyms:
US10301317, Example 193 | US9624228, Example 193
Type:
Small organic molecule
Emp. Form.:
C22H23F3N6O
Mol. Mass.:
444.4528
SMILES:
Cc1cc(ccn1)-c1n[nH]c2cc3NC(=O)N(Cc3cc12)[C@@H]1CCCN(CC(F)(F)F)C1
: