Target
Mitogen-activated protein kinase 1
Ligand
BDBM318261
Substrate
Meas. Tech.
Inhibition Assays of ERK
IC50
<50±n/a nM
Citation
 Li, LWu, TFeng, JRen, PLiu, Y Inhibitors of ERK and methods of use US Patent  US10301317 Publication Date 5/28/2019 
Target
Name:
Mitogen-activated protein kinase 1
Synonyms:
ERK2 Extracellular signal-regulated kinase 2 Extracellular signal-regulated kinase 2 (ERK2) MAPK 2 MK01_HUMAN Mitogen-activated protein kinase 1 (ERK-2) Mitogen-activated protein kinase 2 PRKM2 | p42-MAPK
Type:
Ser/Thr Protein Kinase
Mol. Mass.:
41392.76
Organism:
Homo sapiens (Human)
Description:
P28482
Residue:
360
  
Inhibitor
Name:
BDBM318261
Synonyms:
US10301317, Example 217 | US9624228, Example 217
Type:
Small organic molecule
Emp. Form.:
C22H18ClN5O
Mol. Mass.:
403.864
SMILES:
Cc1cc(ccn1)-c1n[nH]c2cc3NC(=O)N(Cc4ccccc4Cl)Cc3cc12
: