Target
15-hydroxyprostaglandin dehydrogenase [NAD(+)]
Ligand
BDBM393008
Substrate
Meas. Tech.
in vitro assay
IC50
2670±n/a nM
Citation
 Markowitz, SWillson, JKPosner, BReady, JZhang, YTai, HAntczak, MGerson, SBae, KYang, SYDesai, A Compositions and methods of modulating 15-PGDH activity US Patent  US10301320 Publication Date 5/28/2019 
Target
Name:
15-hydroxyprostaglandin dehydrogenase [NAD(+)]
Synonyms:
15-PGDH HPGD PGDH_HUMAN SDR36C1
Type:
Enzyme
Mol. Mass.:
28974.46
Organism:
Homo sapiens (Human)
Description:
P15428
Residue:
266
  
Inhibitor
Name:
BDBM393008
Synonyms:
US10301320, ETSW ID SW202938
Type:
Small organic molecule
Emp. Form.:
C21H21N3O5S
Mol. Mass.:
427.474
SMILES:
COc1ccc(OC)c(c1)N(CC(=O)Nc1ccncc1)S(=O)(=O)c1ccccc1
: