Target
Histone deacetylase 3
Ligand
BDBM375727
Substrate
Meas. Tech.
HDAC Enzyme Inhibition
IC50
<1000±n/a nM
Citation
 Jacques, VRusche, JRPeet, NPSingh, J Histone deacetylase inhibitors US Patent  US10301323 Publication Date 5/28/2019 
Target
Name:
Histone deacetylase 3
Synonyms:
HD3 HDAC3_HUMAN Human HDAC3 SMAP45
Type:
Enzyme
Mol. Mass.:
48829.55
Organism:
Homo sapiens (Human)
Description:
O15379
Residue:
428
  
Inhibitor
Name:
BDBM375727
Synonyms:
US10301323, Compound D9 | US9908899, Compound D9
Type:
Small organic molecule
Emp. Form.:
C22H24N4O
Mol. Mass.:
360.4522
SMILES:
Nc1ccccc1NC(=O)\C=C\c1cnn(CCCCc2ccccc2)c1
: