Target
Histone deacetylase 1
Ligand
BDBM375757
Substrate
Meas. Tech.
HDAC Enzyme Inhibition
IC50
>20000±n/a nM
Citation
 Jacques, VRusche, JRPeet, NPSingh, J Histone deacetylase inhibitors US Patent  US10301323 Publication Date 5/28/2019 
Target
Name:
Histone deacetylase 1
Synonyms:
Cereblon/Histone deacetylase 1 HDAC1 Histone deacetylase 1 (HDAC1) RPD3L1
Type:
Enzyme
Mol. Mass.:
55090.27
Organism:
Homo sapiens (Human)
Description:
Q13547
Residue:
482
  
Inhibitor
Name:
BDBM375757
Synonyms:
US10301323, Compound C2 | US9908899, Compound C2
Type:
Small organic molecule
Emp. Form.:
C13H13FN4O
Mol. Mass.:
260.2669
SMILES:
Cn1cc(\C=C\C(=O)Nc2ccc(F)cc2N)cn1
: