Target
Histone deacetylase 1
Ligand
BDBM375760
Substrate
Meas. Tech.
HDAC Enzyme Inhibition
IC50
3000±n/a nM
Citation
 Jacques, VRusche, JRPeet, NPSingh, J Histone deacetylase inhibitors US Patent  US10301323 Publication Date 5/28/2019 
Target
Name:
Histone deacetylase 1
Synonyms:
Cereblon/Histone deacetylase 1 HDAC1 Histone deacetylase 1 (HDAC1) RPD3L1
Type:
Enzyme
Mol. Mass.:
55090.27
Organism:
Homo sapiens (Human)
Description:
Q13547
Residue:
482
  
Inhibitor
Name:
BDBM375760
Synonyms:
US10301323, Compound C1 | US9908899, Compound C1
Type:
Small organic molecule
Emp. Form.:
C14H16N4O
Mol. Mass.:
256.303
SMILES:
CCn1cc(\C=C\C(=O)Nc2ccccc2N)cn1
: