Target
Histone deacetylase 1
Ligand
BDBM375763
Substrate
Meas. Tech.
HDAC Enzyme Inhibition
IC50
7500±n/a nM
Citation
 Jacques, VRusche, JRPeet, NPSingh, J Histone deacetylase inhibitors US Patent  US10301323 Publication Date 5/28/2019 
Target
Name:
Histone deacetylase 1
Synonyms:
Cereblon/Histone deacetylase 1 HDAC1 Histone deacetylase 1 (HDAC1) RPD3L1
Type:
Enzyme
Mol. Mass.:
55090.27
Organism:
Homo sapiens (Human)
Description:
Q13547
Residue:
482
  
Inhibitor
Name:
BDBM375763
Synonyms:
US10301323, Compound A3 | US9908899, Compound A3
Type:
Small organic molecule
Emp. Form.:
C13H13N3OS
Mol. Mass.:
259.327
SMILES:
Cc1ncc(\C=C\C(=O)Nc2ccccc2N)s1
: