Target
Complement factor D
Ligand
BDBM330247
Substrate
Meas. Tech.
Human Factor D Assay
IC50
>10000±n/a nM
Citation
 Wiles, JAHashimoto, AGadhachanda, VRPais, GWang, QChen, DWang, XAgarwal, ADeshpande, MPhadke, A Phosphonate compounds for treatment of complement mediated disorders US Patent  US10301336 Publication Date 5/28/2019 
Target
Name:
Complement factor D
Synonyms:
Adipsin CFAD_HUMAN DF Properdin factor D
Type:
Protein
Mol. Mass.:
27039.19
Organism:
Homo sapiens (Human)
Description:
P00746
Residue:
253
  
Inhibitor
Name:
BDBM330247
Synonyms:
US10301336, Comp No. 23 ethyl 3-acetyl-1-(2- ((2S,4R)-2-(3-chloro-2- fluorobenzylcarbamoyl)-4- fluoropyrrolidin-1-yl)-2- oxoethyl)-1H-indol-6- yl(phenyl)phosphinate
Type:
Small organic molecule
Emp. Form.:
C32H31ClF2N3O5P
Mol. Mass.:
642.029
SMILES:
CCOP(=O)(c1ccccc1)c1ccc2c(cn(CC(=O)N3C[C@H](F)C[C@H]3C(=O)NCc3cccc(Cl)c3F)c2c1)C(C)=O
: