Target
Peroxisome proliferator-activated receptor gamma
Ligand
BDBM28784
Substrate
BDBM10852
Meas. Tech.
Cell-Based Transcription Assay
EC50
0.54±n/a nM
Citation
 Oon Han, HKim, SHKim, KHHur, GCJoo Yim, HChung, HKHo Woo, SDong Koo, KLee, CSSung Koh, JKim, GT Design and synthesis of oxime ethers of alpha-acyl-beta-phenylpropanoic acids as PPAR dual agonists. Bioorg Med Chem Lett 17:937-41 (2007)  
Target
Name:
Peroxisome proliferator-activated receptor gamma
Synonyms:
NR1C3 PPAR-gamma PPARG_HUMAN Peroxisome proliferator-activated receptor gamma (PPAR gamma) Peroxisome proliferator-activated receptor gamma (PPARĪ³) peroxisome proliferator-activated receptor gamma isoform 2
Type:
Nuclear Receptor
Mol. Mass.:
57613.46
Organism:
Homo sapiens (Human)
Description:
P37231
Residue:
505
  
Inhibitor
Name:
BDBM28784
Synonyms:
(3E)-3-{[(4-fluorophenyl)methoxy]imino}-2-({4-[2-(5-methyl-2-phenyl-1,3-oxazol-4-yl)ethoxy]phenyl}methyl)butanoic acid | alpha-acyl-beta-phenylpropanoic acid deriv., 11i
Type:
Small organic molecule
Emp. Form.:
C30H29FN2O5
Mol. Mass.:
516.5601
SMILES:
C\C(=N/OCc1ccc(F)cc1)C(Cc1ccc(OCCc2nc(oc2C)-c2ccccc2)cc1)C(O)=O
:
Substrate