Target
Peroxisome proliferator-activated receptor alpha
Ligand
BDBM28802
Substrate
BDBM28680
Meas. Tech.
PPAR alpha Fluorescence Polarization Assay (IC50) and Cell-Based Transcription Assay (EC50)
pH
8±n/a
Temperature
295.15±n/a K
IC50
97±25 nM
EC50
4±1 nM
Comments
81 +/- 10 efficacy.
Citation
 Mukherjee, RLocke, KTMiao, BMeyers, DMonshizadegan, HZhang, RSearch, DGrimm, DFlynn, MO'Malley, KMZhang, LLi, JShi, YKennedy, LJBlanar, MCheng, PTTino, JSrivastava, RA Novel peroxisome proliferator-activated receptor alpha agonists lower low-density lipoprotein and triglycerides, raise high-density lipoprotein, and synergistically increase cholesterol excretion with a liver X receptor agonist. J Pharmacol Exp Ther 327:716-26 (2008)  
Target
Name:
Peroxisome proliferator-activated receptor alpha
Synonyms:
NR1C1 PPAR PPAR-alpha PPARA_HUMAN Peroxisome proliferator-activated receptor | Peroxisome proliferator-activated receptor alpha (PPAR alpha)
Type:
Enzyme
Mol. Mass.:
52222.08
Organism:
Homo sapiens (Human)
Description:
Q07869
Residue:
468
  
Inhibitor
Name:
BDBM28802
Synonyms:
2-{[(5-{[2-(4-chlorophenyl)-5-methyl-1,3-oxazol-4-yl]methoxy}-2-fluorophenyl)methyl](methoxycarbonyl)amino}acetic acid | BMS-711939
Type:
Small organic molecule
Emp. Form.:
C22H20ClFN2O6
Mol. Mass.:
462.855
SMILES:
COC(=O)N(CC(O)=O)Cc1cc(OCc2nc(oc2C)-c2ccc(Cl)cc2)ccc1F
:
Substrate
Name:
BDBM28680
Synonyms:
2-[4-(2-{[(2,4-difluorophenyl)carbamoyl](heptyl)amino}ethyl)phenoxy]-2-methylbutanoic acid GW 2331 | [3H]GW 2331
Type:
radiolabeled ligand
Emp. Form.:
C27H36F2N2O4
Mol. Mass.:
490.5825
SMILES:
CCCCCCCN(CCc1ccc(OC(C)(CC)C(O)=O)cc1)C(=O)Nc1ccc(F)cc1F
: