Target
Dimer of Gag-Pol polyprotein [489-587]
Ligand
BDBM398
Substrate
Peptide substrate
Meas. Tech.
Protease Inhibition Assay
pH
6.2±n/a
Temperature
310.15±n/a K
Ki
0.53±n/a nM
IC50
1.8±n/a nM
Citation
 Boyer, FEVara Prasad, JVDomagala, JMEllsworth, ELGajda, CHagen, SEMarkoski, LJTait, BDLunney, EAPalovsky, AFerguson, DGraham, NHoller, THupe, DNouhan, CTummino, PJUrumov, AZeikus, EZeikus, GGracheck, SJSanders, JMVanderRoest, SBrodfuehrer, JIyer, KSinz, MGulnik, SV 5,6-Dihydropyran-2-ones possessing various sulfonyl functionalities: potent nonpeptidic inhibitors of HIV protease. J Med Chem 43:843-58 (2000)  
Target
Name:
Dimer of Gag-Pol polyprotein [489-587]
Synonyms:
HIV-1 Protease
Type:
Protein Complex
Mol. Mass.:
Description:
Components:
This complex has 2 components.
Component 1
Name:
Gag-Pol polyprotein [489-587]
Synonyms:
HIV protease HIV-1 Protease chain A POL_HV1N5 | gag-pol
Type:
Enzyme Subunit
Mol. Mass.:
10822.21
Organism:
Human immunodeficiency virus type 1
Description:
P12497[489-587]
Residue:
99
  
Component 2
Name:
Gag-Pol polyprotein [489-587]
Synonyms:
HIV protease HIV-1 Protease chain A POL_HV1N5 | gag-pol
Type:
Enzyme Subunit
Mol. Mass.:
10822.21
Organism:
Human immunodeficiency virus type 1
Description:
P12497[489-587]
Residue:
99
  
Inhibitor
Name:
BDBM398
Synonyms:
CHEMBL287361 N-[5-tert-butyl-4-({4-hydroxy-6-[2-(4-hydroxyphenyl)ethyl]-2-oxo-6-(propan-2-yl)-5,6-dihydro-2H-pyran-3-yl}sulfanyl)-2-methylphenyl]benzenesulfonamide
Type:
Small organic molecule
Emp. Form.:
C33H39NO6S2
Mol. Mass.:
609.796
SMILES:
CC(C)C1(CCc2ccc(O)cc2)CC(=O)C(Sc2cc(C)c(NS(=O)(=O)c3ccccc3)cc2C(C)(C)C)C(=O)O1
:
Substrate
Name:
Peptide substrate
Synonyms:
Type:
Peptide
Mol. Mass.:
3763.66
Organism:
Description:
Residue:
35