Target
Dihydroorotate dehydrogenase (quinone), mitochondrial
Ligand
BDBM28837
Substrate
BDBM14700
Meas. Tech.
DHODH Inhibition Assay
IC50
800±n/a nM
Citation
 Gujjar, RMarwaha, AEl Mazouni, FWhite, JWhite, KLCreason, SShackleford, DMBaldwin, JCharman, WNBuckner, FSCharman, SRathod, PKPhillips, MA Identification of a metabolically stable triazolopyrimidine-based dihydroorotate dehydrogenase inhibitor with antimalarial activity in mice. J Med Chem 52:1864-72 (2009)  
Target
Name:
Dihydroorotate dehydrogenase (quinone), mitochondrial
Synonyms:
DHOdehase Dihydroorotate dehydrogenase homolog PYRD_PLAF7
Type:
Enzyme
Mol. Mass.:
65581.88
Organism:
Plasmodium falciparum (isolate 3D7)
Description:
Q08210
Residue:
569
  
Inhibitor
Name:
BDBM28837
Synonyms:
N-[4-chloro-3-(trifluoromethyl)phenyl]-5-methyl-[1,2,4]triazolo[1,5-a]pyrimidin-7-amine | triazolopyrimidine-based compound, DSM124
Type:
Small organic molecule
Emp. Form.:
C13H9ClF3N5
Mol. Mass.:
327.692
SMILES:
Cc1cc(Nc2ccc(Cl)c(c2)C(F)(F)F)n2ncnc2n1
:
Substrate
Name:
BDBM14700
Synonyms:
2,3-dimethoxy-5-methyl-6-decyl-1,4-benzoquinone Decylubiquinone
Type:
Ubiquinone analog
Emp. Form.:
C19H30O4
Mol. Mass.:
322.4391
SMILES:
CCCCCCCCC=Cc1c(C)c(O)c(OC)c(OC)c1O
: