Target
Carbonic anhydrase 12
Ligand
BDBM50240183
Substrate
Meas. Tech.
Inhibition Assay
Ki
7.40±n/a nM
Citation
 Supuran, CDedhar, SMcDonald, PCCarta, F Sulfonamide compounds for inhibition of metastatic tumor growth US Patent  US9962398 Publication Date 5/8/2018 
Target
Name:
Carbonic anhydrase 12
Synonyms:
CA-XII CAH12_HUMAN Carbonic anhydrase Carbonic anhydrase XII Carbonic anhydrase XII (CAXII) | Tumor antigen HOM-RCC-3.1.3
Type:
Enzyme
Mol. Mass.:
39456.00
Organism:
Homo sapiens (Human)
Description:
Catalytic domain of human cloned isozyme was used in the assay
Residue:
354
  
Inhibitor
Name:
BDBM50240183
Synonyms:
CHEMBL4080618 | US9962398, Compound MST-135
Type:
Small organic molecule
Emp. Form.:
C13H11BrFN3O3S
Mol. Mass.:
388.212
SMILES:
NS(=O)(=O)c1ccc(NC(=O)Nc2ccc(Br)cc2F)cc1
: