Target
Carbonic anhydrase 9
Ligand
BDBM50240181
Substrate
Meas. Tech.
Inhibition Assay
Ki
7.40±n/a nM
Citation
 Supuran, CDedhar, SMcDonald, PCCarta, F Sulfonamide compounds for inhibition of metastatic tumor growth US Patent  US9962398 Publication Date 5/8/2018 
Target
Name:
Carbonic anhydrase 9
Synonyms:
CA-IX CAH9_HUMAN Carbonic anhydrase 9 (CA IX) Carbonic anhydrase 9 precursor Carbonic anhydrase IX (CAIX) Carbonic anhydrases; II & IX MN RCC-associated antigen G250
Type:
Enzyme
Mol. Mass.:
49669.03
Organism:
Homo sapiens (Human)
Description:
Catalytic domain of human cloned isozyme was used in the assay
Residue:
459
  
Inhibitor
Name:
BDBM50240181
Synonyms:
CHEMBL4060262 | US9962398, Compound MST-138
Type:
Small organic molecule
Emp. Form.:
C14H11F4N3O3S
Mol. Mass.:
377.314
SMILES:
NS(=O)(=O)c1ccc(NC(=O)Nc2cc(ccc2F)C(F)(F)F)cc1
: