Target
Carbonic anhydrase 1
Ligand
BDBM50240180
Substrate
Meas. Tech.
Inhibition Assay
Ki
395±n/a nM
Citation
 Supuran, CDedhar, SMcDonald, PCCarta, F Sulfonamide compounds for inhibition of metastatic tumor growth US Patent  US9962398 Publication Date 5/8/2018 
Target
Name:
Carbonic anhydrase 1
Synonyms:
CA-I CAB Carbonate dehydratase I Carbonic anhydrase 1 (CA I) Carbonic anhydrase 1 (Recombinant CA I) Carbonic anhydrase B Carbonic anhydrase I (CA I) Carbonic anhydrase I (CAI) Carbonic anhydrase isoenzyme I (hCA I) | hCA
Type:
Enzyme
Mol. Mass.:
28873.37
Organism:
Homo sapiens (Human)
Description:
P00915
Residue:
261
  
Inhibitor
Name:
BDBM50240180
Synonyms:
CHEMBL4096209 | US9962398, Compound MST-139
Type:
Small organic molecule
Emp. Form.:
C14H11F4N3O3S
Mol. Mass.:
377.314
SMILES:
NS(=O)(=O)c1ccc(NC(=O)Nc2cccc(c2F)C(F)(F)F)cc1
: