Target
Carbonic anhydrase 1
Ligand
BDBM50240174
Substrate
Meas. Tech.
Inhibition Assay
Ki
158±n/a nM
Citation
 Supuran, CDedhar, SMcDonald, PCCarta, F Sulfonamide compounds for inhibition of metastatic tumor growth US Patent  US9962398 Publication Date 5/8/2018 
Target
Name:
Carbonic anhydrase 1
Synonyms:
CA-I CAB Carbonate dehydratase I Carbonic anhydrase 1 (CA I) Carbonic anhydrase 1 (Recombinant CA I) Carbonic anhydrase B Carbonic anhydrase I (CA I) Carbonic anhydrase I (CAI) Carbonic anhydrase isoenzyme I (hCA I) | hCA
Type:
Enzyme
Mol. Mass.:
28873.37
Organism:
Homo sapiens (Human)
Description:
P00915
Residue:
261
  
Inhibitor
Name:
BDBM50240174
Synonyms:
CHEMBL4100248 | US9962398, Compound MST-147
Type:
Small organic molecule
Emp. Form.:
C13H11F2N3O3S
Mol. Mass.:
327.307
SMILES:
NS(=O)(=O)c1ccc(NC(=O)Nc2c(F)cccc2F)cc1
: