Target
Cytochrome P450 3A4
Ligand
BDBM393290
Substrate
Meas. Tech.
Inhibition Assay
IC50
140±n/a nM
Citation
 Diaz, PIsoherranen, NButtrick, BGuilloteau, N Specific inhibitors of cytochrome P450 26 retinoic acid hydroxylase US Patent  US9963439 Publication Date 5/8/2018 
Target
Name:
Cytochrome P450 3A4
Synonyms:
Albendazole monooxygenase CP3A4_HUMAN CYP3A4 CYPIIIA4 Cytochrome P450 3A4 (CYP3A4) Nifedipine oxidase Taurochenodeoxycholate 6-alpha-hydroxylase
Type:
Enzyme
Mol. Mass.:
57349.57
Organism:
Homo sapiens (Human)
Description:
Residue:
503
  
Inhibitor
Name:
BDBM393290
Synonyms:
DDBEP | US9963439, Tazarotenic acid
Type:
Small organic molecule
Emp. Form.:
C19H17NO2S
Mol. Mass.:
323.409
SMILES:
CC1(C)CCSc2ccc(cc12)C#Cc1ccc(cn1)C(O)=O
: