Target
Botulinum neurotoxin type A2 [1-425]
Ligand
BDBM28870
Substrate
SNAPtide
Meas. Tech.
MAPKKide Assay
IC50
160000±n/a nM
Citation
 Johnson, SLChen, LHHarbach, RSabet, MSavinov, ACotton, NJStrongin, AGuiney, DPellecchia, M Rhodanine derivatives as selective protease inhibitors against bacterial toxins. Chem Biol Drug Des 71:131-9 (2008)  
Target
Name:
Botulinum neurotoxin type A2 [1-425]
Synonyms:
BXA2_CLOBJ Botulinum Neurotoxin Type A atx bonT botA
Type:
Metalloprotease
Mol. Mass.:
48687.43
Organism:
Clostridium botulinum
Description:
Recombinant C. botulinum LC/A (1-425) was expressed in E. coli.
Residue:
425
  
Inhibitor
Name:
BDBM28870
Synonyms:
2-[(5Z)-4-oxo-5-{[1-phenyl-3-(thiophen-2-yl)-1H-pyrazol-4-yl]methylidene}-2-sulfanylidene-1,3-thiazolidin-3-yl]acetic acid | rhodanine derivative, 29
Type:
Small organic molecule
Emp. Form.:
C19H13N3O3S3
Mol. Mass.:
427.52
SMILES:
OC(=O)CN1C(=S)S\C(=C/c2cn(nc2-c2cccs2)-c2ccccc2)C1=O
:
Substrate
Name:
SNAPtide
Synonyms:
Type:
Fluorogenic Substrate
Mol. Mass.:
358.43
Organism:
Description:
Peptide derived from synaptosomes associated protein, SNAP-25. (U.S. Patent #6504006. List Biological Laboratories, Inc., Campbell, CA.).
Residue:
3
NA