Target
N-acylethanolamine-hydrolyzing acid amidase
Ligand
BDBM393309
Substrate
Meas. Tech.
Inhibition Assay
IC50
>1000±n/a nM
Citation
 Malamas, MMakriyannis, ASubramanian, KVWhitten, KMZvonok, NMWest, JMMccormack, MPavlopoulos, S N-acylethanolamine hydrolyzing acid amidase (NAAA) inhibitors and their use thereof US Patent  US9963444 Publication Date 5/8/2018 
Target
Name:
N-acylethanolamine-hydrolyzing acid amidase
Synonyms:
ASAH-like protein Acid ceramidase-like protein N-acylsphingosine amidohydrolase-like NAAA PLT
Type:
Enzyme
Mol. Mass.:
40073.12
Organism:
Homo sapiens (Human)
Description:
Q02083
Residue:
359
  
Inhibitor
Name:
BDBM393309
Synonyms:
4-(Morpholinomethyl)benzylisothiocyanate | US9963444, Example 12
Type:
Small organic molecule
Emp. Form.:
C13H16N2OS
Mol. Mass.:
248.344
SMILES:
S=C=NCc1ccc(CN2CCOCC2)cc1
: