Target
N-acylethanolamine-hydrolyzing acid amidase
Ligand
BDBM393408
Substrate
Meas. Tech.
Inhibition Assay
IC50
>1000±n/a nM
Citation
 Malamas, MMakriyannis, ASubramanian, KVWhitten, KMZvonok, NMWest, JMMccormack, MPavlopoulos, S N-acylethanolamine hydrolyzing acid amidase (NAAA) inhibitors and their use thereof US Patent  US9963444 Publication Date 5/8/2018 
Target
Name:
N-acylethanolamine-hydrolyzing acid amidase
Synonyms:
ASAH-like protein Acid ceramidase-like protein N-acylsphingosine amidohydrolase-like NAAA PLT
Type:
Enzyme
Mol. Mass.:
40073.12
Organism:
Homo sapiens (Human)
Description:
Q02083
Residue:
359
  
Inhibitor
Name:
BDBM393408
Synonyms:
2-(3-((3'-Methoxy-[1,1'-biphenyl]-4-yl)methoxy)azetidin-1-yl)acetonitrile | US9963444, Example 109
Type:
Small organic molecule
Emp. Form.:
C19H20N2O2
Mol. Mass.:
308.3743
SMILES:
COc1cccc(c1)-c1ccc(COC2CN(CC#N)C2)cc1
: